Target
Neuronal acetylcholine receptor subunit alpha-4/beta-2
Ligand
BDBM50100717
Substrate
Meas. Tech.
ChEMBL_143720 (CHEMBL753471)
Ki
0.031±n/a nM
Citation
 Carroll, FILiang, FNavarro, HABrieaddy, LEAbraham, PDamaj, MIMartin, BR Synthesis, nicotinic acetylcholine receptor binding, and antinociceptive properties of 2-exo-2-(2'-substituted 5'-pyridinyl)-7-azabicyclo[2.2.1]heptanes. Epibatidine analogues. J Med Chem 44:2229-37 (2001)  
Target
Name:
Neuronal acetylcholine receptor subunit alpha-4/beta-2
Synonyms:
Neuronal acetylcholine receptor alpha4/beta2 Neuronal acetylcholine receptor; alpha4/beta2
Type:
Mol. Mass.:
Description:
Components:
This complex has 0 components.
Component 1
Name:
Neuronal acetylcholine receptor subunit alpha-4
Synonyms:
ACHA4_RAT Cholinergic, Nicotinic Alpha4Beta2 Chrna4 Neuronal acetylcholine receptor (alpha4beta2 nAChR) Neuronal acetylcholine receptor subunit alpha 4 beta 2 | Neuronal acetylcholine receptor subunit alpha-4
Type:
Enzyme
Mol. Mass.:
70196.44
Organism:
Rattus norvegicus (Rat)
Description:
P09483
Residue:
630
  
Component 2
Name:
Neuronal acetylcholine receptor subunit beta-2
Synonyms:
ACHB2_RAT Chrnb2 Neuronal acetylcholine receptor non-alpha-1 chain
Type:
Enzyme
Mol. Mass.:
56910.32
Organism:
Rattus norvegicus (Rat)
Description:
P12390
Residue:
500
  
Inhibitor
Name:
BDBM50100717
Synonyms:
2-(pyridin-3-yl)-7-aza-bicyclo[2.2.1]heptane CHEMBL56817
Type:
Small organic molecule
Emp. Form.:
C11H14N2
Mol. Mass.:
174.2423
SMILES:
C1CC2NC1CC2c1cccnc1
: