Target
Prostaglandin G/H synthase 2
Ligand
BDBM50057915
Substrate
Meas. Tech.
ChEMBL_157693 (CHEMBL763870)
IC50
398.11±n/a nM
Citation
 Chavatte, PYous, SMarot, CBaurin, NLesieur, D Three-dimensional quantitative structure-activity relationships of cyclo-oxygenase-2 (COX-2) inhibitors: a comparative molecular field analysis. J Med Chem 44:3223-30 (2001)  
Target
Name:
Prostaglandin G/H synthase 2
Synonyms:
COX2 Cyclooxygenase 2 (COX-2) Cyclooxygenase-2 (COX-2 AA) Cyclooxygenase-2 (COX-2) PGH2_HUMAN PHS II Prostaglandin E synthase/G/H synthase 2 Prostaglandin-endoperoxide synthase 2
Type:
Enzyme
Mol. Mass.:
69003.89
Organism:
Homo sapiens (Human)
Description:
Recombinant Cox-2 provided by Cayman (Cayman Chemical Co.,Ann Arbor, MI).
Residue:
604
  
Inhibitor
Name:
BDBM50057915
Synonyms:
2-(2-Fluoro-phenyl)-1-(4-methanesulfonyl-phenyl)-4-trifluoromethyl-1H-imidazole | CHEMBL43645
Type:
Small organic molecule
Emp. Form.:
C17H12F4N2O2S
Mol. Mass.:
384.348
SMILES:
CS(=O)(=O)c1ccc(cc1)-n1cc(nc1-c1ccccc1F)C(F)(F)F
: