Target
Beta-2 adrenergic receptor
Ligand
BDBM50002133
Substrate
Meas. Tech.
ChEMBL_218263 (CHEMBL819428)
IC50
9.12±n/a nM
Citation
 Tanaka, NTamai, TMukaiyama, HHirabayashi, AMuranaka, HAkahane, SMiyata, HAkahane, M Discovery of novel N-phenylglycine derivatives as potent and selective beta(3)-adrenoceptor agonists for the treatment of frequent urination and urinary incontinence. J Med Chem 44:1436-45 (2001)  
Target
Name:
Beta-2 adrenergic receptor
Synonyms:
ADRB2_RAT Adrb2r | Adrenergic receptor beta
Type:
PROTEIN
Mol. Mass.:
46896.26
Organism:
Rattus norvegicus
Description:
ChEMBL_38603
Residue:
418
  
Inhibitor
Name:
BDBM50002133
Synonyms:
(+/-)-2-(4-((R)-2-((R)-2-(3-chlorophenyl)-2-hydroxyethylamino)propyl)phenoxy)acetic acid (4-{2-[(R)-2-((R)-3-Chloro-phenyl)-2-hydroxy-ethylamino]-propyl}-phenoxy)-acetic acid (BRL 37,344)(4-{2-[2-(3-Chloro-phenyl)-2-hydroxy-ethylamino]-propyl}-phenoxy)-acetic acid 2-(4-((R)-2-((R)-2-(3-chlorophenyl)-2-hydroxyethylamino)propyl)phenoxy)acetic acid CHEMBL284782
Type:
Small organic molecule
Emp. Form.:
C19H22ClNO4
Mol. Mass.:
363.835
SMILES:
C[C@H](Cc1ccc(OCC(O)=O)cc1)NC[C@H](O)c1cccc(Cl)c1
: