Target
Tyrosine-protein phosphatase non-receptor type 1
Ligand
BDBM50149238
Substrate
Meas. Tech.
ChEMBL_162108 (CHEMBL767799)
IC50
162000000±n/a nM
Citation
 Cross, KPMyatt, GYang, CFligner, MAVerducci, JSBlower, PE Finding discriminating structural features by reassembling common building blocks. J Med Chem 46:4770-5 (2003)  
Target
Name:
Tyrosine-protein phosphatase non-receptor type 1
Synonyms:
PTN1_HUMAN PTPN1 Protein tyrosine phosphatase-1B (PTP1B) Protein-tyrosine phosphatase 1B (PTP1B) Tyrosine-protein phosphatase non-receptor type 1 (PTP1B)
Type:
Protein phosphatase
Mol. Mass.:
49963.76
Organism:
Homo sapiens (Human)
Description:
Human recombinant GST-fusion PTP1B (1-435).
Residue:
435
  
Inhibitor
Name:
BDBM50149238
Synonyms:
4-Hydroxybiphenyl 4-biphenylol 4-hydroxydiphenyl CHEMBL73380 biphenyl-4-ol p-hydroxybiphenyl p-phenylphenol para-phenylphenol
Type:
Small organic molecule
Emp. Form.:
C12H10O
Mol. Mass.:
170.2072
SMILES:
Oc1ccc(cc1)-c1ccccc1
: