Target
Neuronal acetylcholine receptor subunit alpha-3/beta-4
Ligand
BDBM50049757
Substrate
Meas. Tech.
ChEMBL_310813 (CHEMBL825005)
EC50
0.037000±n/a nM
Citation
 Fitch, RWKaneko, YKlaperski, PDaly, JWSeitz, GGündisch, D Halogenated and isosteric cytisine derivatives with increased affinity and functional activity at nicotinic acetylcholine receptors. Bioorg Med Chem Lett 15:1221-4 (2005)  
Target
Name:
Neuronal acetylcholine receptor subunit alpha-3/beta-4
Synonyms:
Neuronal acetylcholine receptor Alpha-3/Beta-4 Neuronal acetylcholine receptor; alpha3/beta4 | nAChR subtypes alpha3 beta4
Type:
Protein
Mol. Mass.:
Description:
Components:
This complex has 2 components.
Component 1
Name:
Neuronal acetylcholine receptor subunit alpha-3
Synonyms:
ACHA3_RAT Chrna3
Type:
Enzyme
Mol. Mass.:
56995.52
Organism:
Rattus norvegicus (Rat)
Description:
P04757
Residue:
499
  
Component 2
Name:
Neuronal acetylcholine receptor subunit beta-4
Synonyms:
ACHB4_RAT Chrnb4 Neuronal acetylcholine receptor non-alpha-2 chain | Neuronal acetylcholine receptor protein beta-4 subunit
Type:
Enzyme
Mol. Mass.:
55863.89
Organism:
Rattus norvegicus (Rat)
Description:
P12392
Residue:
495
  
Inhibitor
Name:
BDBM50049757
Synonyms:
()-2-(6-Chloro-pyridin-3-yl)-7-aza-bicyclo[2.2.1]heptane (+)-epibatidine (1R,2R,4S)-epibatidine (2R,4S)-2-(6-Chloro-pyridin-3-yl)-7-aza-bicyclo[2.2.1]heptane (2R,4S)-2-(6-chloropyridin-3-yl)-7-aza-bicyclo[2.2.1]heptane (R)-2-(6-Chloro-pyridin-3-yl)-7-methyl-7-aza-bicyclo[2.2.1]heptane 2-(6-Chloro-pyridin-3-yl)-7-aza-bicyclo[2.2.1]heptane 2-(6-Chloro-pyridin-3-yl)-7-aza-bicyclo[2.2.1]heptane(+/-) epibatidine 2-(6-Chloro-pyridin-3-yl)-7-azonia-bicyclo[2.2.1]heptane 2-Pyridin-3-yl-7-aza-bicyclo[2.2.1]heptane EPIBATIDINE Epibatidine-(+) exo-2-(6-chloropyridin-3-yl)-7-aza-bicyclo[2.2.1]heptane | rac-(2R)-2-(6-chloropyridin-3-yl)-7-aza-bicyclo[2.2.1]heptane
Type:
Small organic molecule
Emp. Form.:
C11H13ClN2
Mol. Mass.:
208.687
SMILES:
Clc1ccc(cn1)C1CC2CCC1N2
: