Target
Growth hormone secretagogue receptor type 1
Ligand
BDBM50366689
Substrate
Meas. Tech.
ChEMBL_310274 (CHEMBL833105)
EC50
1.4±n/a nM
Citation
 Li, JJWang, HQu, FMusial, CTino, JARobl, JASlusarchyk, DGolla, RSeethala, RDickinson, KGiupponi, LGrover, GSleph, PFlynn, NMurphy, BJGordon, DKung, MStoffel, R Tetrahydroisoquinoline 1-carboxamides as growth hormone secretagogues. Bioorg Med Chem Lett 15:1799-802 (2005)  
Target
Name:
Growth hormone secretagogue receptor type 1
Synonyms:
GH-releasing peptide receptor GHS-R GHSR_HUMAN Ghrelin receptor | Ghrelin receptor 1a (GHS-R1a)
Type:
Receptor
Mol. Mass.:
41334.57
Organism:
Homo sapiens (Human)
Description:
Receptor binding studies use plasma membranes from LLC PK-1 cells transiently transfected with hGHSR1a.
Residue:
366
  
Inhibitor
Name:
BDBM50366689
Synonyms:
GHRELIN
Type:
Small organic molecule
Emp. Form.:
C147H245N45O42
Mol. Mass.:
3314.7945
SMILES:
CCCCCCCC(=O)OC[C@H](NC(=O)CNC(=O)[C@@H](N)CCCN=C(N)N)C(=O)N[C@@H](CO)C(=O)N[C@@H](Cc1ccccc1)C(=O)N[C@@H](CC(C)C)C(=O)N[C@@H](CO)C(=O)N1CCC[C@H]1C(=O)N[C@@H](CCC(O)=O)C(=O)N[C@@H](Cc1cnc[nH]1)C(=O)N[C@@H](CCC(N)=O)C(=O)N[C@@H](CCCCN)C(=O)N[C@@H](C)C(=O)N[C@@H](CCC(N)=O)C(=O)N[C@@H](CCC(N)=O)C(=O)N[C@@H](CCCN=C(N)N)C(=O)N[C@@H](CCCCN)C(=O)N[C@@H](CCC(O)=O)C(=O)N[C@@H](CO)C(=O)N[C@@H](CCCCN)C(=O)N[C@@H](CCCCN)C(=O)N1CCC[C@H]1C(=O)N1CCC[C@H]1C(=O)N[C@@H](C)C(=O)N[C@@H](CCCCN)C(=O)N[C@@H](CC(C)C)C(=O)N[C@@H](CCC(N)=O)C(=O)N1CCC[C@H]1C(O)=O
: