Target
Androgen receptor
Ligand
BDBM50187243
Substrate
Meas. Tech.
ChEMBL_321687 (CHEMBL872182)
IC50
8128.31±n/a nM
Citation
 Lill, MAWiniger, FVedani, AErnst, B Impact of induced fit on ligand binding to the androgen receptor: a multidimensional QSAR study to predict endocrine-disrupting effects of environmental chemicals. J Med Chem 48:5666-74 (2005)  
Target
Name:
Androgen receptor
Synonyms:
ANDR_RAT Ar Nr3c4 | androgen
Type:
Enzyme
Mol. Mass.:
98219.08
Organism:
Rattus norvegicus (Rat)
Description:
P15207
Residue:
902
  
Inhibitor
Name:
BDBM50187243
Synonyms:
17-ethinyl-3,17-estradiol 17-ethinylestradiol 17alpha-ethynylestra-1,3,5(10)-triene-3,17beta-diol CHEMBL691 Ethinylestradiol ethinyloestradiol
Type:
Small organic molecule
Emp. Form.:
C20H24O2
Mol. Mass.:
296.4034
SMILES:
C[C@]12CC[C@H]3[C@@H](CCc4cc(O)ccc34)[C@@H]1CC[C@@]2(O)C#C
: