Target
Integrin alpha-V/beta-3
Ligand
BDBM50187746
Substrate
Meas. Tech.
ChEMBL_362085 (CHEMBL863123)
IC50
880±n/a nM
Citation
 Del Gatto, AZaccaro, LGrieco, PNovellino, EZannetti, ADel Vecchio, SIommelli, FSalvatore, MPedone, CSaviano, M Novel and selective alpha(v)beta3 receptor peptide antagonist: design, synthesis, and biological behavior. J Med Chem 49:3416-20 (2006)  
Target
Name:
Integrin alpha-V/beta-3
Synonyms:
ITGAV/ITGB3 | Integrin beta-3/Vitronectin receptor alpha
Type:
Enzyme
Mol. Mass.:
Description:
Components:
This complex has 2 components.
Component 1
Name:
Integrin alpha-V
Synonyms:
ITAV_HUMAN Integrin alpha-V/alpha-5 VNRA Vitronectin receptor | Vitronectin receptor subunit alpha
Type:
PROTEIN
Mol. Mass.:
116024.92
Organism:
Homo sapiens (Human)
Description:
ChEMBL_582336
Residue:
1048
  
Component 2
Name:
Integrin beta-3
Synonyms:
CD_antigen=CD61 GPIIIa ITGB3 Platelet membrane glycoprotein IIIa
Type:
Protein
Mol. Mass.:
87038.91
Organism:
Homo sapiens (Human)
Description:
P05106
Residue:
788
  
Inhibitor
Name:
BDBM50187746
Synonyms:
CHEMBL384337 | RGDechi
Type:
Small organic molecule
Emp. Form.:
C84H134N30O29S
Mol. Mass.:
2060.211
SMILES:
CSCCC(NC(=O)CCC1NC(=O)C(CC(O)=O)NC(=O)CNC(=O)C(CCCN=C(N)N)NC(=O)C(CCCCN)NC1=O)C(=O)NC(CC(O)=O)C(=O)NC(CC(O)=O)C(=O)N1CCCC1C(=O)NCC(=O)NC(N)=NCCC[C@H](N)C(=O)N[C@@H](CC(N)=O)C(=O)N1CCC[C@H]1C(=O)N[C@@H](Cc1cnc[nH]1)C(=O)N[C@@H](CCCCN)C(=O)NCC(=O)N1CCC[C@H]1C(=O)N[C@@H](C)C(=O)N[C@@H]([C@@H](C)O)C(O)=O
: