Target
Cathepsin S
Ligand
BDBM50374300
Substrate
Meas. Tech.
ChEMBL_365371 (CHEMBL863025)
Ki
470±n/a nM
Citation
 Palmer, JTHirschbein, BLCheung, HMcCarter, JJanc, JWYu, ZWWesolowski, G Keto-1,3,4-oxadiazoles as cathepsin K inhibitors. Bioorg Med Chem Lett 16:2909-14 (2006)  
Target
Name:
Cathepsin S
Synonyms:
CATS_HUMAN Cathepsin S (Cat S) | cathepsin S preproprotein
Type:
Protein
Mol. Mass.:
37507.38
Organism:
Homo sapiens (Human)
Description:
P25774
Residue:
331
  
Inhibitor
Name:
BDBM50374300
Synonyms:
CHEMBL405602
Type:
Small organic molecule
Emp. Form.:
C24H29F3N4O5
Mol. Mass.:
510.5061
SMILES:
CCC[C@H](NC(=O)C1(CCCCC1)NC(=O)c1ccc(OC(F)(F)F)cc1)C(=O)c1nnc(CC)o1
: