Target
Cathepsin B
Ligand
BDBM50410971
Substrate
Meas. Tech.
ChEMBL_365369 (CHEMBL871199)
Ki
75±n/a nM
Citation
 Palmer, JTHirschbein, BLCheung, HMcCarter, JJanc, JWYu, ZWWesolowski, G Keto-1,3,4-oxadiazoles as cathepsin K inhibitors. Bioorg Med Chem Lett 16:2909-14 (2006)  
Target
Name:
Cathepsin B
Synonyms:
APP secretase CATB_HUMAN CTSB Cathepsin B light chain | Cathepsin B1
Type:
Enzyme
Mol. Mass.:
37819.69
Organism:
Homo sapiens (Human)
Description:
gi_63102437
Residue:
339
  
Inhibitor
Name:
BDBM50410971
Synonyms:
CHEMBL378899
Type:
Small organic molecule
Emp. Form.:
C28H30F3N5O7
Mol. Mass.:
605.5623
SMILES:
CCC[C@H](NC(=O)C(NC(=O)c1ccc(OC(F)(F)F)cc1)C(=O)C1(N)CCCCC1)C(=O)c1nnc(o1)-c1ccco1
: