Target
Tryptase beta-2
Ligand
BDBM50411006
Substrate
Meas. Tech.
ChEMBL_370996 (CHEMBL868494)
Ki
2.5±n/a nM
Citation
 Palmer, JTRydzewski, RMMendonca, RVSperandio, DSpencer, JRHirschbein, BLLohman, JBeltman, JNguyen, MLiu, L Design and synthesis of selective keto-1,2,4-oxadiazole-based tryptase inhibitors. Bioorg Med Chem Lett 16:3434-9 (2006)  
Target
Name:
Tryptase beta-2
Synonyms:
TPS2 TRYB2_HUMAN Tryptase II Tryptase-2
Type:
PROTEIN
Mol. Mass.:
30518.79
Organism:
Homo sapiens (Human)
Description:
ChEMBL_210702
Residue:
275
  
Inhibitor
Name:
BDBM50411006
Synonyms:
CHEMBL539088
Type:
Small organic molecule
Emp. Form.:
C30H29Cl2FN4O4
Mol. Mass.:
599.48
SMILES:
NCCCC[C@H](NC(=O)c1ccc(F)cc1)C(=O)c1noc(Cc2ccc(OCCc3ccc(Cl)c(Cl)c3)cc2)n1
: