Target
Plasminogen
Ligand
BDBM50187800
Substrate
Meas. Tech.
ChEMBL_370999 (CHEMBL868497)
Ki
430±n/a nM
Citation
 Palmer, JTRydzewski, RMMendonca, RVSperandio, DSpencer, JRHirschbein, BLLohman, JBeltman, JNguyen, MLiu, L Design and synthesis of selective keto-1,2,4-oxadiazole-based tryptase inhibitors. Bioorg Med Chem Lett 16:3434-9 (2006)  
Target
Name:
Plasminogen
Synonyms:
Activation peptide PLG Plasmin Plasmin heavy chain A, short form | Plasmin light chain B
Type:
Enzyme
Mol. Mass.:
90579.18
Organism:
Homo sapiens (Human)
Description:
Residue:
810
  
Inhibitor
Name:
BDBM50187800
Synonyms:
(S)-ethyl 1-(5-(4-phenethoxybenzyl)-1,2,4-oxadiazol-3-yl)-6-amino-1-oxohexan-2-ylcarbamate | CHEMBL211561
Type:
Small organic molecule
Emp. Form.:
C26H32N4O5
Mol. Mass.:
480.5561
SMILES:
CCOC(=O)N[C@@H](CCCCN)C(=O)c1noc(Cc2ccc(OCCc3ccccc3)cc2)n1
: