Target
Granzyme K
Ligand
BDBM50187800
Substrate
Meas. Tech.
ChEMBL_371006 (CHEMBL868504)
Ki
>150000±n/a nM
Citation
 Palmer, JTRydzewski, RMMendonca, RVSperandio, DSpencer, JRHirschbein, BLLohman, JBeltman, JNguyen, MLiu, L Design and synthesis of selective keto-1,2,4-oxadiazole-based tryptase inhibitors. Bioorg Med Chem Lett 16:3434-9 (2006)  
Target
Name:
Granzyme K
Synonyms:
Fragmentin-3 GZMK NK-TRYP-2 TRYP2
Type:
PROTEIN
Mol. Mass.:
28902.79
Organism:
Homo sapiens (Human)
Description:
ChEMBL_162618
Residue:
264
  
Inhibitor
Name:
BDBM50187800
Synonyms:
(S)-ethyl 1-(5-(4-phenethoxybenzyl)-1,2,4-oxadiazol-3-yl)-6-amino-1-oxohexan-2-ylcarbamate | CHEMBL211561
Type:
Small organic molecule
Emp. Form.:
C26H32N4O5
Mol. Mass.:
480.5561
SMILES:
CCOC(=O)N[C@@H](CCCCN)C(=O)c1noc(Cc2ccc(OCCc3ccccc3)cc2)n1
: