Target
Reverse transcriptase/RNaseH
Ligand
BDBM50411078
Substrate
Meas. Tech.
ChEMBL_373031 (CHEMBL871578)
EC50
6520±n/a nM
Citation
 Mugnaini, CManetti, FEsté, JAClotet-Codina, IMaga, GCancio, RBotta, MCorelli, F Synthesis and biological investigation of S-aryl-S-DABO derivatives as HIV-1 inhibitors. Bioorg Med Chem Lett 16:3541-4 (2006)  
Target
Name:
Reverse transcriptase/RNaseH
Synonyms:
HIV-1 Reverse Transcriptase RNase H Reverse transcriptase/RNaseH
Type:
PROTEIN
Mol. Mass.:
65229.15
Organism:
Human immunodeficiency virus 1
Description:
ChEMBL_1473730
Residue:
566
  
Inhibitor
Name:
BDBM50411078
Synonyms:
CHEMBL211326
Type:
Small organic molecule
Emp. Form.:
C18H15Cl2N3O2S
Mol. Mass.:
408.302
SMILES:
COc1ccc(Sc2nc(Cc3c(Cl)cccc3Cl)c(C)c(=O)[nH]2)cn1
: