Target
Reverse transcriptase/RNaseH
Ligand
BDBM50411077
Substrate
Meas. Tech.
ChEMBL_373030 (CHEMBL871577)
EC50
42500±n/a nM
Citation
 Mugnaini, CManetti, FEsté, JAClotet-Codina, IMaga, GCancio, RBotta, MCorelli, F Synthesis and biological investigation of S-aryl-S-DABO derivatives as HIV-1 inhibitors. Bioorg Med Chem Lett 16:3541-4 (2006)  
Target
Name:
Reverse transcriptase/RNaseH
Synonyms:
HIV-1 Reverse Transcriptase RNase H Reverse transcriptase/RNaseH
Type:
PROTEIN
Mol. Mass.:
65229.15
Organism:
Human immunodeficiency virus 1
Description:
ChEMBL_1473730
Residue:
566
  
Inhibitor
Name:
BDBM50411077
Synonyms:
CHEMBL212430
Type:
Small organic molecule
Emp. Form.:
C18H14F2N2OS
Mol. Mass.:
344.378
SMILES:
Cc1c(Cc2c(F)cccc2F)nc(Sc2ccccc2)[nH]c1=O
: