Target
Reverse transcriptase/RNaseH
Ligand
BDBM50411081
Substrate
Meas. Tech.
ChEMBL_373028 (CHEMBL871572)
EC50
1800±n/a nM
Citation
 Mugnaini, CManetti, FEsté, JAClotet-Codina, IMaga, GCancio, RBotta, MCorelli, F Synthesis and biological investigation of S-aryl-S-DABO derivatives as HIV-1 inhibitors. Bioorg Med Chem Lett 16:3541-4 (2006)  
Target
Name:
Reverse transcriptase/RNaseH
Synonyms:
HIV-1 Reverse Transcriptase RNase H Reverse transcriptase/RNaseH
Type:
PROTEIN
Mol. Mass.:
65229.15
Organism:
Human immunodeficiency virus 1
Description:
ChEMBL_1473730
Residue:
566
  
Inhibitor
Name:
BDBM50411081
Synonyms:
CHEMBL208918
Type:
Small organic molecule
Emp. Form.:
C18H14Cl2N2OS
Mol. Mass.:
377.288
SMILES:
Cc1c(Cc2c(Cl)cccc2Cl)nc(Sc2ccccc2)[nH]c1=O
: