Target
Reverse transcriptase/RNaseH
Ligand
BDBM50411074
Substrate
Meas. Tech.
ChEMBL_373028 (CHEMBL871572)
EC50
26500±n/a nM
Citation
 Mugnaini, CManetti, FEsté, JAClotet-Codina, IMaga, GCancio, RBotta, MCorelli, F Synthesis and biological investigation of S-aryl-S-DABO derivatives as HIV-1 inhibitors. Bioorg Med Chem Lett 16:3541-4 (2006)  
Target
Name:
Reverse transcriptase/RNaseH
Synonyms:
HIV-1 Reverse Transcriptase RNase H Reverse transcriptase/RNaseH
Type:
PROTEIN
Mol. Mass.:
65229.15
Organism:
Human immunodeficiency virus 1
Description:
ChEMBL_1473730
Residue:
566
  
Inhibitor
Name:
BDBM50411074
Synonyms:
CHEMBL211344
Type:
Small organic molecule
Emp. Form.:
C19H16Cl2N2O2S
Mol. Mass.:
407.314
SMILES:
COc1ccc(Sc2nc(Cc3c(Cl)cccc3Cl)c(C)c(=O)[nH]2)cc1
: