Target
Acyl carrier protein, mitochondrial
Ligand
BDBM50411088
Substrate
Meas. Tech.
ChEMBL_373476 (CHEMBL853536)
IC50
9±n/a nM
Citation
 Ichimaru, NAbe, MMurai, MSenoh, MNishioka, TMiyoshi, H Function of the alkyl side chains of Deltalac-acetogenins in the inhibitory effect on mitochondrial complex I (NADH-ubiquinone oxidoreductase). Bioorg Med Chem Lett 16:3555-8 (2006)  
Target
Name:
Acyl carrier protein, mitochondrial
Synonyms:
ACP CI-SDAP NDUFAB1
Type:
PROTEIN
Mol. Mass.:
17397.64
Organism:
Bos taurus
Description:
ChEMBL_469770
Residue:
156
  
Inhibitor
Name:
BDBM50411088
Synonyms:
CHEMBL211108
Type:
Small organic molecule
Emp. Form.:
C34H66O4
Mol. Mass.:
538.8854
SMILES:
CCCCCCCCCCCC[C@@H](O)[C@H]1CC[C@@H](O1)[C@H]1CC[C@@H](O1)[C@H](O)CCCCCCCCCCCC
: