Target
Salicyl-AMP ligase / salicyl-S-ArCP synthetase
Ligand
BDBM50411238
Substrate
Meas. Tech.
ChEMBL_423930 (CHEMBL911945)
Ki
61±n/a nM
Citation
 Somu, RVWilson, DJBennett, EMBoshoff, HICelia, LBeck, BJBarry, CEAldrich, CC Antitubercular nucleosides that inhibit siderophore biosynthesis: SAR of the glycosyl domain. J Med Chem 49:7623-35 (2006)  
Target
Name:
Salicyl-AMP ligase / salicyl-S-ArCP synthetase
Synonyms:
2,3-dihydroxybenzoate-AMP ligase mbtA
Type:
PROTEIN
Mol. Mass.:
59275.32
Organism:
Mycobacterium tuberculosis
Description:
ChEMBL_423930
Residue:
565
  
Inhibitor
Name:
BDBM50411238
Synonyms:
CHEMBL385125
Type:
Small organic molecule
Emp. Form.:
C18H20N6O5S
Mol. Mass.:
432.454
SMILES:
Nc1ncnc2ncn([C@H]3CC[C@@H](COS(=O)(=O)NC(=O)c4ccccc4O)C3)c12
: