Target
Cholecystokinin receptor type A
Ligand
BDBM50002890
Substrate
Meas. Tech.
ChEMBL_439004 (CHEMBL889350)
Ki
7079±n/a nM
Citation
 McDonald, IMBlack, JWBuck, IMDunstone, DJGriffin, EPHarper, EAHull, RAKalindjian, SBLilley, EJLinney, IDPether, MJRoberts, SPShaxted, MESpencer, JSteel, KISykes, DAWalker, MKWatt, GFWright, LWright, PTXun, W Optimization of 1,3,4-benzotriazepine-based CCK(2) antagonists to obtain potent, orally active inhibitors of gastrin-mediated gastric acid secretion. J Med Chem 50:3101-12 (2007)  
Target
Name:
Cholecystokinin receptor type A
Synonyms:
CCK-A receptor CCK1-R CCKAR_HUMAN Cholecystokinin receptor Cholecystokinin-1 Receptor
Type:
G Protein-Coupled Receptor (GPCR)
Mol. Mass.:
47859.34
Organism:
Homo sapiens (Human)
Description:
Stable expression of human CCK-1 receptors in HEK 293 cells.
Residue:
428
  
Inhibitor
Name:
BDBM50002890
Synonyms:
CHEMBL389019
Type:
Small organic molecule
Emp. Form.:
C26H30N4O5
Mol. Mass.:
478.5402
SMILES:
CC(C)C1=NN(CC(=O)Nc2cccc(c2)C(O)=O)C(=O)N(CC(=O)C(C)(C)C)c2ccccc12
: