Target
Gastrin/cholecystokinin type B receptor
Ligand
BDBM50411338
Substrate
Meas. Tech.
ChEMBL_439007 (CHEMBL889353)
Ki
4.7±n/a nM
Citation
 McDonald, IMBlack, JWBuck, IMDunstone, DJGriffin, EPHarper, EAHull, RAKalindjian, SBLilley, EJLinney, IDPether, MJRoberts, SPShaxted, MESpencer, JSteel, KISykes, DAWalker, MKWatt, GFWright, LWright, PTXun, W Optimization of 1,3,4-benzotriazepine-based CCK(2) antagonists to obtain potent, orally active inhibitors of gastrin-mediated gastric acid secretion. J Med Chem 50:3101-12 (2007)  
Target
Name:
Gastrin/cholecystokinin type B receptor
Synonyms:
CCKBR Cholecystokinin B receptor Gastrin/cholecystokinin type B receptor
Type:
Enzyme Catalytic Domain
Mol. Mass.:
48544.19
Organism:
Dog
Description:
Cholecystokinin B 0 Dog::P30552
Residue:
453
  
Inhibitor
Name:
BDBM50411338
Synonyms:
CHEMBL227254
Type:
Small organic molecule
Emp. Form.:
C30H37N9O3
Mol. Mass.:
571.6733
SMILES:
CN(c1nnn[nH]1)c1cccc(NC(=O)CN2N=C(C3CCCCC3)c3ccccc3N(CC(=O)C(C)(C)C)C2=O)c1
: