Target
Carboxypeptidase A1
Ligand
BDBM50411727
Substrate
Meas. Tech.
ChEMBL_465247 (CHEMBL932068)
Ki
12000±n/a nM
Citation
 Deaton, DNGao, ENGraham, KPGross, JWMiller, ABStrelow, JM Thiol-based angiotensin-converting enzyme 2 inhibitors: P1 modifications for the exploration of the S1 subsite. Bioorg Med Chem Lett 18:732-7 (2008)  
Target
Name:
Carboxypeptidase A1
Synonyms:
CBPA1_HUMAN CPA1
Type:
PROTEIN
Mol. Mass.:
47132.61
Organism:
Homo sapiens (Human)
Description:
ChEMBL_1496378
Residue:
419
  
Inhibitor
Name:
BDBM50411727
Synonyms:
CHEMBL257026
Type:
Small organic molecule
Emp. Form.:
C23H27NO3S
Mol. Mass.:
397.53
SMILES:
OC(=O)[C@H](Cc1ccc(cc1)-c1ccccc1)NC(=O)[C@@H](S)C1CCCCC1
: