Target
Angiotensin-converting enzyme 2
Ligand
BDBM50411723
Substrate
Meas. Tech.
ChEMBL_465244 (CHEMBL933038)
Ki
550±n/a nM
Citation
 Deaton, DNGao, ENGraham, KPGross, JWMiller, ABStrelow, JM Thiol-based angiotensin-converting enzyme 2 inhibitors: P1 modifications for the exploration of the S1 subsite. Bioorg Med Chem Lett 18:732-7 (2008)  
Target
Name:
Angiotensin-converting enzyme 2
Synonyms:
ACE-related carboxypeptidase ACE2_HUMAN Angiotensin-converting enzyme homolog Metalloprotease MPROT15
Type:
Enzyme
Mol. Mass.:
92448.86
Organism:
Homo sapiens (Human)
Description:
Residue:
805
  
Inhibitor
Name:
BDBM50411723
Synonyms:
CHEMBL272925
Type:
Small organic molecule
Emp. Form.:
C28H25NO3S
Mol. Mass.:
455.568
SMILES:
OC(=O)[C@H](Cc1ccc(cc1)-c1ccccc1)NC(=O)[C@@H](S)Cc1ccc2ccccc2c1
: