Target
Acyl carrier protein, mitochondrial
Ligand
BDBM50411909
Substrate
Meas. Tech.
ChEMBL_469770 (CHEMBL948046)
IC50
1010±n/a nM
Citation
 Surup, FShojaei, Hvon Zezschwitz, PKunze, BGrond, S Iromycins from Streptomyces sp. and from synthesis: new inhibitors of the mitochondrial electron transport chain. Bioorg Med Chem 16:1738-46 (2008)  
Target
Name:
Acyl carrier protein, mitochondrial
Synonyms:
ACP CI-SDAP NDUFAB1
Type:
PROTEIN
Mol. Mass.:
17397.64
Organism:
Bos taurus
Description:
ChEMBL_469770
Residue:
156
  
Inhibitor
Name:
BDBM50411909
Synonyms:
IROMYCIN M
Type:
Small organic molecule
Emp. Form.:
C18H29NO2
Mol. Mass.:
291.4284
SMILES:
CCCCC\C(C)=C\Cc1[nH]c(=O)c(C)c(O)c1CCC
: