Target
Acyl carrier protein, mitochondrial
Ligand
BDBM50411918
Substrate
Meas. Tech.
ChEMBL_469770 (CHEMBL948046)
IC50
>25300±n/a nM
Citation
 Surup, FShojaei, Hvon Zezschwitz, PKunze, BGrond, S Iromycins from Streptomyces sp. and from synthesis: new inhibitors of the mitochondrial electron transport chain. Bioorg Med Chem 16:1738-46 (2008)  
Target
Name:
Acyl carrier protein, mitochondrial
Synonyms:
ACP CI-SDAP NDUFAB1
Type:
PROTEIN
Mol. Mass.:
17397.64
Organism:
Bos taurus
Description:
ChEMBL_469770
Residue:
156
  
Inhibitor
Name:
BDBM50411918
Synonyms:
IROMYCIN F
Type:
Small organic molecule
Emp. Form.:
C19H29NO3
Mol. Mass.:
319.4385
SMILES:
CCCC1C(C=CC(C)C\C=C\C(C)C)=NC(=O)C(C)(O)C1=O
: