Target
Alpha-2A adrenergic receptor
Ligand
BDBM50412257
Substrate
Meas. Tech.
ChEMBL_487917 (CHEMBL1015736)
Ki
240±n/a nM
Citation
 Gentili, FCardinaletti, CVesprini, CCarrieri, AGhelfi, FFarande, AGiannella, MPiergentili, AQuaglia, WLaurila, JMHuhtinen, AScheinin, MPigini, M Alpha2-adrenoreceptors profile modulation. 4. From antagonist to agonist behavior. J Med Chem 51:4289-99 (2008)  
Target
Name:
Alpha-2A adrenergic receptor
Synonyms:
ADA2A_HUMAN ADRA2R Adrenergic alpha2A Alpha-2 adrenergic receptor subtype C10 Alpha-2A adrenoreceptor alpha-2A adrenergic receptor [Homo sapiens]
Type:
Enzyme
Mol. Mass.:
48979.91
Organism:
Homo sapiens (Human)
Description:
P08913
Residue:
450
  
Inhibitor
Name:
BDBM50412257
Synonyms:
CHEMBL523048
Type:
Small organic molecule
Emp. Form.:
C22H20N2O
Mol. Mass.:
328.407
SMILES:
C1CN=C(N1)C(Oc1ccccc1-c1ccccc1)c1ccccc1
: