Target
3-oxoacyl-[acyl-carrier-protein] synthase 3
Ligand
BDBM23570
Substrate
Meas. Tech.
ChEMBL_510888 (CHEMBL997780)
IC50
1600±n/a nM
Citation
 Singh, SSoni, LKGupta, MKPrabhakar, YSKaskhedikar, SG QSAR studies on benzoylaminobenzoic acid derivatives as inhibitors of beta-ketoacyl-acyl carrier protein synthase III. Eur J Med Chem 43:1071-80 (2008)  
Target
Name:
3-oxoacyl-[acyl-carrier-protein] synthase 3
Synonyms:
3-oxoacyl-[acyl-carrier-protein] synthase 3 Beta-ketoacyl-ACP synthase III KAS III fabH
Type:
Acyltransferase; homodimer
Mol. Mass.:
35176.53
Organism:
Enterococcus faecalis
Description:
The E. faecalis FabH was cloned, and protein was expressed in E. coli.
Residue:
321
  
Inhibitor
Name:
BDBM23570
Synonyms:
2-{[4-bromo-3-(diethylsulfamoyl)benzene]amido}benzoic acid | Diethylsulfonamide Derivative, 13a
Type:
Small organic molecule
Emp. Form.:
C18H19BrN2O5S
Mol. Mass.:
455.323
SMILES:
CCN(CC)S(=O)(=O)c1cc(ccc1Br)C(=O)Nc1ccccc1C(O)=O
: