Target
Muscarinic acetylcholine receptor M3
Ligand
BDBM50412728
Substrate
Meas. Tech.
ChEMBL_539023 (CHEMBL1035697)
Ki
0.0316±n/a nM
Citation
 Jin, JBudzik, BWang, YShi, DWang, FXie, HWan, ZZhu, CFoley, JJWebb, EFBerlanga, MBurman, MSarau, HMMorrow, DMMoore, MLRivero, RAPalovich, MSalmon, MBelmonte, KELainé, DI Discovery of biphenyl piperazines as novel and long acting muscarinic acetylcholine receptor antagonists. J Med Chem 51:5915-8 (2008)  
Target
Name:
Muscarinic acetylcholine receptor M3
Synonyms:
ACM3_HUMAN Cholinergic, muscarinic M3 Muscarinic receptor M3 | RecName: Full=Muscarinic acetylcholine receptor M3
Type:
Enzyme
Mol. Mass.:
66151.03
Organism:
Homo sapiens (Human)
Description:
P20309
Residue:
590
  
Inhibitor
Name:
BDBM50412728
Synonyms:
CHEMBL521523
Type:
Small organic molecule
Emp. Form.:
C32H39FN4O
Mol. Mass.:
514.6767
SMILES:
C[C@H]1CN(Cc2cccc(c2)-c2cc(CNC(=O)c3cccc(CC4CCNCC4)c3)ccc2F)CCN1
: