Target
5-hydroxytryptamine receptor 1B
Ligand
BDBM50413071
Substrate
Meas. Tech.
ChEMBL_492739 (CHEMBL938539)
Ki
7.94±n/a nM
Citation
 Bromidge, SMBertani, BBorriello, MFaedo, SGordon, LJGranci, EHill, MMarshall, HRStasi, LPZucchelli, VMerlo, GVesentini, AWatson, JMZonzini, L 6-[2-(4-Aryl-1-piperazinyl)ethyl]-2H-1,4-benzoxazin-3(4H)-ones: dual-acting 5-HT1 receptor antagonists and serotonin reuptake inhibitors. Bioorg Med Chem Lett 18:5653-6 (2008)  
Target
Name:
5-hydroxytryptamine receptor 1B
Synonyms:
5-HT-1B 5-HT1B 5HT1B_HUMAN HTR1DB Serotonin (5-HT) receptor Serotonin Receptor 1B
Type:
G Protein-Coupled Receptor (GPCR)
Mol. Mass.:
43579.17
Organism:
Homo sapiens (Human)
Description:
Receptor binding assays were performed using human clone stably expressed in CHO cells
Residue:
390
  
Inhibitor
Name:
BDBM50413071
Synonyms:
CHEMBL521873
Type:
Small organic molecule
Emp. Form.:
C25H28N4O2
Mol. Mass.:
416.5154
SMILES:
C[C@@H]1CN(CCN1CCc1ccc2OCC(=O)Nc2c1)c1cccc2nc(C)ccc12
: