Target
Neuronal acetylcholine receptor subunit alpha-4
Ligand
BDBM50088454
Substrate
Meas. Tech.
ChEMBL_562742 (CHEMBL1022414)
IC50
1±n/a nM
Citation
 Tosco, PAhring, PKDyhring, TPeters, DHarpsøe, KLiljefors, TBalle, T Complementary three-dimensional quantitative structure-activity relationship modeling of binding affinity and functional potency: a study on alpha4beta2 nicotinic ligands. J Med Chem 52:2311-6 (2009)  
Target
Name:
Neuronal acetylcholine receptor subunit alpha-4
Synonyms:
ACHA4_HUMAN CHRNA4 protein Neuronal acetylcholine receptor protein alpha-4 subunit Nicotinic acetylcholine receptor alpha4/beta2/alpha5
Type:
Mol. Mass.:
69963.49
Organism:
Homo sapiens (Human)
Description:
NACHRA4
Residue:
627
  
Inhibitor
Name:
BDBM50088454
Synonyms:
1-(6-Bromo-pyridin-3-yl)-[1,4]diazepane CHEMBL306387 | NS3920, 4
Type:
Small organic molecule
Emp. Form.:
C10H14BrN3
Mol. Mass.:
256.142
SMILES:
Brc1ccc(cn1)N1CCCNCC1
: