Target
Sodium-dependent serotonin transporter
Ligand
BDBM50413553
Substrate
Meas. Tech.
ChEMBL_501245 (CHEMBL976147)
Ki
19.95±n/a nM
Citation
 Bromidge, SMBertani, BBorriello, MBozzoli, AFaedo, SGianotti, MGordon, LJHill, MZucchelli, VWatson, JMZonzini, L 8-[2-(4-Aryl-1-piperazinyl)ethyl]-2H-1,4-benzoxazin-3(4H)-ones: dual-acting 5-HT1 receptor antagonists and serotonin reuptake inhibitors--part II. Bioorg Med Chem Lett 19:2338-42 (2009)  
Target
Name:
Sodium-dependent serotonin transporter
Synonyms:
5-HT Transporter 5HTT SC6A4_HUMAN SLC6A4 Serotonin transporter (5HTT) Sodium-dependent serotonin transporter (SERT) | Solute carrier family 6 member 4
Type:
Multi-pass membrane protein
Mol. Mass.:
70322.51
Organism:
Homo sapiens (Human)
Description:
P31645
Residue:
630
  
Inhibitor
Name:
BDBM50413553
Synonyms:
CHEMBL472290
Type:
Small organic molecule
Emp. Form.:
C26H30N4O2
Mol. Mass.:
430.542
SMILES:
CCN1C(=O)COc2c(CCN3CCN(CC3)c3cccc4nc(C)ccc34)cccc12
: