Target
D(2) dopamine receptor
Ligand
BDBM50020680
Substrate
Meas. Tech.
ChEMBL_501713 (CHEMBL981461)
Ki
691.83±n/a nM
Citation
 Peglion, JLPoitevin, CMannoury La Cour, CDupuis, DMillan, MJ Modulations of the amide function of the preferential dopamine D3 agonist (R,R)-S32504: improvements of affinity and selectivity for D3 versus D2 receptors. Bioorg Med Chem Lett 19:2133-8 (2009)  
Target
Name:
D(2) dopamine receptor
Synonyms:
D(2) dopamine receptor DOPAMINE D2 Long DRD2 Dopamine D2 receptor Dopamine D2 receptor (D2R) Dopamine2-like | d2
Type:
Cell-surface receptors
Mol. Mass.:
50647.10
Organism:
Homo sapiens (Human)
Description:
P14416
Residue:
443
  
Inhibitor
Name:
BDBM50020680
Synonyms:
4-[2-(dipropylamino)ethyl]-1,3-dihydro-2H-indol-2-one ROPINIROLE
Type:
Small organic molecule
Emp. Form.:
C16H24N2O
Mol. Mass.:
260.3746
SMILES:
CCCN(CCC)CCc1cccc2NC(=O)Cc12
: