Target
Cannabinoid receptor 2
Ligand
BDBM50170338
Substrate
Meas. Tech.
ChEMBL_570539 (CHEMBL1026911)
Ki
158.85±n/a nM
Citation
 De Freitas, GBda Silva, LLRomeiro, NCFraga, CA Development of CoMFA and CoMSIA models of affinity and selectivity for indole ligands of cannabinoid CB1 and CB2 receptors. Eur J Med Chem 44:2482-96 (2009)  
Target
Name:
Cannabinoid receptor 2
Synonyms:
CANNABINOID CB2 CB2 CB2B CNR2_HUMAN Cannabinoid CB2 receptor Cannabinoid receptor 2 (CB2R) | hCB2
Type:
G Protein-Coupled Receptor (GPCR)
Mol. Mass.:
39690.94
Organism:
Homo sapiens (Human)
Description:
P34972
Residue:
360
  
Inhibitor
Name:
BDBM50170338
Synonyms:
1-(1-Pentyl-1H-indol-3-yl)-2-phenyl-ethanone CHEMBL365878 | JWH-167
Type:
Small organic molecule
Emp. Form.:
C21H23NO
Mol. Mass.:
305.4134
SMILES:
CCCCCn1cc(C(=O)Cc2ccccc2)c2ccccc12
: