Target
Cannabinoid receptor 1
Ligand
BDBM50170350
Substrate
Meas. Tech.
ChEMBL_570538 (CHEMBL1026910)
Ki
1600±n/a nM
Citation
 De Freitas, GBda Silva, LLRomeiro, NCFraga, CA Development of CoMFA and CoMSIA models of affinity and selectivity for indole ligands of cannabinoid CB1 and CB2 receptors. Eur J Med Chem 44:2482-96 (2009)  
Target
Name:
Cannabinoid receptor 1
Synonyms:
Brain-type cannabinoid receptor CB-R CNR1_RAT Cannabinoid receptor Cnr1 | Skr6
Type:
G Protein-Coupled Receptor (GPCR)
Mol. Mass.:
52856.55
Organism:
Rattus norvegicus (rat)
Description:
P20272
Residue:
473
  
Inhibitor
Name:
BDBM50170350
Synonyms:
2-(4-Chloro-phenyl)-1-(2-methyl-1-pentyl-1H-indol-3-yl)-ethanone CHEMBL187813 | JWH-207
Type:
Small organic molecule
Emp. Form.:
C22H24ClNO
Mol. Mass.:
353.885
SMILES:
CCCCCn1c(C)c(C(=O)Cc2ccc(Cl)cc2)c2ccccc12
: