Target
Cannabinoid receptor 2
Ligand
BDBM50170356
Substrate
Meas. Tech.
ChEMBL_570539 (CHEMBL1026911)
Ki
25±n/a nM
Citation
 De Freitas, GBda Silva, LLRomeiro, NCFraga, CA Development of CoMFA and CoMSIA models of affinity and selectivity for indole ligands of cannabinoid CB1 and CB2 receptors. Eur J Med Chem 44:2482-96 (2009)  
Target
Name:
Cannabinoid receptor 2
Synonyms:
CANNABINOID CB2 CB2 CB2B CNR2_HUMAN Cannabinoid CB2 receptor Cannabinoid receptor 2 (CB2R) | hCB2
Type:
G Protein-Coupled Receptor (GPCR)
Mol. Mass.:
39690.94
Organism:
Homo sapiens (Human)
Description:
P34972
Residue:
360
  
Inhibitor
Name:
BDBM50170356
Synonyms:
2-(2-Chloro-phenyl)-1-(2-methyl-1-pentyl-1H-indol-3-yl)-ethanone CHEMBL361032 | JWH-204
Type:
Small organic molecule
Emp. Form.:
C22H24ClNO
Mol. Mass.:
353.885
SMILES:
CCCCCn1c(C)c(C(=O)Cc2ccccc2Cl)c2ccccc12
: