Target
Serine/threonine-protein kinase Chk1
Ligand
BDBM50414095
Substrate
Meas. Tech.
ChEMBL_570759 (CHEMBL1026934)
Ki
1.6±n/a nM
Citation
 Brown, SPMuchmore, SW Large-scale application of high-throughput molecular mechanics with Poisson-Boltzmann surface area for routine physics-based scoring of protein-ligand complexes. J Med Chem 52:3159-65 (2009)  
Target
Name:
Serine/threonine-protein kinase Chk1
Synonyms:
CHEK1 CHK1 checkpoint homolog Checkpoint kinase-1 (CHK1)
Type:
Enzyme Catalytic Domain
Mol. Mass.:
54443.02
Organism:
Homo sapiens (Human)
Description:
gi_166295192
Residue:
476
  
Inhibitor
Name:
BDBM50414095
Synonyms:
CHEMBL542007
Type:
Small organic molecule
Emp. Form.:
C16H16ClN5O3
Mol. Mass.:
361.783
SMILES:
Nc1cc2OC\C=C\CCOc3cncc(NC(=O)Nc2cc1Cl)n3
: