Target
Serine/threonine-protein kinase Chk1
Ligand
BDBM14605
Substrate
Meas. Tech.
ChEMBL_570759 (CHEMBL1026934)
Ki
4±n/a nM
Citation
 Brown, SPMuchmore, SW Large-scale application of high-throughput molecular mechanics with Poisson-Boltzmann surface area for routine physics-based scoring of protein-ligand complexes. J Med Chem 52:3159-65 (2009)  
Target
Name:
Serine/threonine-protein kinase Chk1
Synonyms:
CHEK1 CHK1 checkpoint homolog Checkpoint kinase-1 (CHK1)
Type:
Enzyme Catalytic Domain
Mol. Mass.:
54443.02
Organism:
Homo sapiens (Human)
Description:
gi_166295192
Residue:
476
  
Inhibitor
Name:
BDBM14605
Synonyms:
1-(4-amino-5-chloro-2-methoxyphenyl)-3-(5-cyanopyrazin-2-yl)urea N-pyrazinylurea Analog 7
Type:
Small organic molecule
Emp. Form.:
C13H11ClN6O2
Mol. Mass.:
318.718
SMILES:
COc1cc(N)c(Cl)cc1NC(=O)Nc1cnc(cn1)C#N
: