Target
Urokinase-type plasminogen activator
Ligand
BDBM50157087
Substrate
Meas. Tech.
ChEMBL_570757 (CHEMBL1026932)
Ki
5±n/a nM
Citation
 Brown, SPMuchmore, SW Large-scale application of high-throughput molecular mechanics with Poisson-Boltzmann surface area for routine physics-based scoring of protein-ligand complexes. J Med Chem 52:3159-65 (2009)  
Target
Name:
Urokinase-type plasminogen activator
Synonyms:
PLAU UROK_HUMAN Urokinase-type plasminogen activator (uPA) | Urokinase-type plasminogen activator/surface receptor
Type:
Enzyme
Mol. Mass.:
48528.62
Organism:
Homo sapiens (Human)
Description:
P00749
Residue:
431
  
Inhibitor
Name:
BDBM50157087
Synonyms:
6-(2-Phenyl-cyclopropyl)-8-(pyrimidin-2-ylamino)-naphthalene-2-carboxamidine CHEMBL182959
Type:
Small organic molecule
Emp. Form.:
C24H21N5
Mol. Mass.:
379.457
SMILES:
NC(=N)c1ccc2cc(cc(Nc3ncccn3)c2c1)C1CC1c1ccccc1
: