Target
Alpha-1D adrenergic receptor
Ligand
BDBM50414396
Substrate
Meas. Tech.
ChEMBL_574170 (CHEMBL1060371)
Ki
0.17±n/a nM
Citation
 Giardinà, DMartarelli, DSagratini, GAngeli, PBallinari, DGulini, UMelchiorre, CPoggesi, EPompei, P Doxazosin-related alpha1-adrenoceptor antagonists with prostate antitumor activity. J Med Chem 52:4951-4 (2009)  
Target
Name:
Alpha-1D adrenergic receptor
Synonyms:
ADA1D_HUMAN ADRA1D Adrenergic receptor alpha Alpha 1D-adrenoreceptor Alpha-1D adrenoceptor adrenergic Alpha1D
Type:
Enzyme Catalytic Domain
Mol. Mass.:
60485.82
Organism:
Homo sapiens (Human)
Description:
adrenergic Alpha1D ADRA1D HUMAN::P25100
Residue:
572
  
Inhibitor
Name:
BDBM50414396
Synonyms:
CHEMBL564481
Type:
Small organic molecule
Emp. Form.:
C27H31N5O5
Mol. Mass.:
505.5655
SMILES:
COc1cc2nc(nc(N)c2cc1OC)N1CCN([C@H]2CCCC[C@@H]12)C(=O)C1COc2ccccc2O1
: