Target
Sodium-dependent noradrenaline transporter
Ligand
BDBM50414593
Substrate
Meas. Tech.
ChEMBL_582671 (CHEMBL1051045)
Ki
7.94±n/a nM
Citation
 Lucas, MCCarter, DSCai, HYLee, EKSchoenfeld, RCSteiner, SVilla, MWeikert, RJIyer, PS Novel, achiral aminoheterocycles as selective monoamine reuptake inhibitors. Bioorg Med Chem Lett 19:4630-3 (2009)  
Target
Name:
Sodium-dependent noradrenaline transporter
Synonyms:
Monoamine transporter NET Noradrenaline Transporter (NET) Norepinephrine transporter protein (NET) SLC6A2 Sodium-dependent noradrenaline transporter (NET) | Solute carrier family 6 member 2
Type:
Multi-pass membrane protein
Mol. Mass.:
69337.72
Organism:
Homo sapiens (Human)
Description:
P23975
Residue:
617
  
Inhibitor
Name:
BDBM50414593
Synonyms:
CHEMBL560535
Type:
Small organic molecule
Emp. Form.:
C20H23N3
Mol. Mass.:
305.4167
SMILES:
C(N(C1CCNCC1)c1ccc2[nH]ccc2c1)c1ccccc1
: