Target
Sodium-dependent serotonin transporter
Ligand
BDBM50414600
Substrate
Meas. Tech.
ChEMBL_582670 (CHEMBL1051044)
Ki
0.251±n/a nM
Citation
 Lucas, MCCarter, DSCai, HYLee, EKSchoenfeld, RCSteiner, SVilla, MWeikert, RJIyer, PS Novel, achiral aminoheterocycles as selective monoamine reuptake inhibitors. Bioorg Med Chem Lett 19:4630-3 (2009)  
Target
Name:
Sodium-dependent serotonin transporter
Synonyms:
5-HT Transporter 5HTT SC6A4_HUMAN SLC6A4 Serotonin transporter (5HTT) Sodium-dependent serotonin transporter (SERT) | Solute carrier family 6 member 4
Type:
Multi-pass membrane protein
Mol. Mass.:
70322.51
Organism:
Homo sapiens (Human)
Description:
P31645
Residue:
630
  
Inhibitor
Name:
BDBM50414600
Synonyms:
CHEMBL570317
Type:
Small organic molecule
Emp. Form.:
C21H22N4
Mol. Mass.:
330.4262
SMILES:
N#Cc1cccc(CN(C2CCNCC2)c2ccc3[nH]ccc3c2)c1
: