Target
Sodium-dependent serotonin transporter
Ligand
BDBM50414586
Substrate
Meas. Tech.
ChEMBL_582670 (CHEMBL1051044)
Ki
6.31±n/a nM
Citation
 Lucas, MCCarter, DSCai, HYLee, EKSchoenfeld, RCSteiner, SVilla, MWeikert, RJIyer, PS Novel, achiral aminoheterocycles as selective monoamine reuptake inhibitors. Bioorg Med Chem Lett 19:4630-3 (2009)  
Target
Name:
Sodium-dependent serotonin transporter
Synonyms:
5-HT Transporter 5HTT SC6A4_HUMAN SLC6A4 Serotonin transporter (5HTT) Sodium-dependent serotonin transporter (SERT) | Solute carrier family 6 member 4
Type:
Multi-pass membrane protein
Mol. Mass.:
70322.51
Organism:
Homo sapiens (Human)
Description:
P31645
Residue:
630
  
Inhibitor
Name:
BDBM50414586
Synonyms:
CHEMBL564288
Type:
Small organic molecule
Emp. Form.:
C21H25N3
Mol. Mass.:
319.4433
SMILES:
C(Cc1ccccc1)N(C1CCNCC1)c1ccc2[nH]ccc2c1
: