Target
Eukaryotic translation initiation factor 2-alpha kinase 1
Ligand
BDBM50414893
Substrate
Meas. Tech.
ChEMBL_589403 (CHEMBL1058424)
IC50
7.94±n/a nM
Citation
 Rosen, MDWoods, CRGoldberg, SDHack, MDBounds, ADYang, YWagaman, PCPhuong, VKAmeriks, APBarrett, TDKanelakis, KCChuang, JCChang, JShankley, NPRabinowitz, MH Discovery of the first known small-molecule inhibitors of heme-regulated eukaryotic initiation factor 2alpha (HRI) kinase. Bioorg Med Chem Lett 19:6548-51 (2009)  
Target
Name:
Eukaryotic translation initiation factor 2-alpha kinase 1
Synonyms:
E2AK1_HUMAN HRI | KIAA1369
Type:
PROTEIN
Mol. Mass.:
71098.55
Organism:
Homo sapiens (Human)
Description:
ChEMBL_1467744
Residue:
630
  
Inhibitor
Name:
BDBM50414893
Synonyms:
CHEMBL578426
Type:
Small organic molecule
Emp. Form.:
C21H23N3O2
Mol. Mass.:
349.4262
SMILES:
COc1cc2Cc3c(NCc4c(C)cccc4C)[nH]nc3-c2cc1OC
: