Target
Eukaryotic translation initiation factor 2-alpha kinase 1
Ligand
BDBM50414894
Substrate
Meas. Tech.
ChEMBL_589403 (CHEMBL1058424)
IC50
6.31±n/a nM
Citation
 Rosen, MDWoods, CRGoldberg, SDHack, MDBounds, ADYang, YWagaman, PCPhuong, VKAmeriks, APBarrett, TDKanelakis, KCChuang, JCChang, JShankley, NPRabinowitz, MH Discovery of the first known small-molecule inhibitors of heme-regulated eukaryotic initiation factor 2alpha (HRI) kinase. Bioorg Med Chem Lett 19:6548-51 (2009)  
Target
Name:
Eukaryotic translation initiation factor 2-alpha kinase 1
Synonyms:
E2AK1_HUMAN HRI | KIAA1369
Type:
PROTEIN
Mol. Mass.:
71098.55
Organism:
Homo sapiens (Human)
Description:
ChEMBL_1467744
Residue:
630
  
Inhibitor
Name:
BDBM50414894
Synonyms:
CHEMBL573760
Type:
Small organic molecule
Emp. Form.:
C19H15Cl2N3O3
Mol. Mass.:
404.247
SMILES:
COc1cc2C(=O)c3c(NCc4c(Cl)cccc4Cl)[nH]nc3-c2cc1OC
: