Target
Alpha-2A adrenergic receptor
Ligand
BDBM50027060
Substrate
Meas. Tech.
ChEMBL_595094 (CHEMBL1047080)
Ki
59±n/a nM
Citation
 Cardinaletti, CMattioli, LGhelfi, FDel Bello, FGiannella, MBruzzone, AParis, HPerfumi, MPiergentili, AQuaglia, WPigini, M Might adrenergic alpha2C-agonists/alpha2A-antagonists become novel therapeutic tools for pain treatment with morphine? J Med Chem 52:7319-22 (2009)  
Target
Name:
Alpha-2A adrenergic receptor
Synonyms:
ADA2A_HUMAN ADRA2R Adrenergic alpha2A Alpha-2 adrenergic receptor subtype C10 Alpha-2A adrenoreceptor alpha-2A adrenergic receptor [Homo sapiens]
Type:
Enzyme
Mol. Mass.:
48979.91
Organism:
Homo sapiens (Human)
Description:
P08913
Residue:
450
  
Inhibitor
Name:
BDBM50027060
Synonyms:
2-(2-Cyclopropyl-phenoxymethyl)-4,5-dihydro-1H-imidazole CHEMBL13852 | CIRAZOLINE
Type:
Small organic molecule
Emp. Form.:
C13H16N2O
Mol. Mass.:
216.2789
SMILES:
C(Oc1ccccc1C1CC1)C1=NCCN1
: