Target
Alpha-2C adrenergic receptor
Ligand
BDBM50415136
Substrate
Meas. Tech.
ChEMBL_595089 (CHEMBL1047075)
EC50
50±n/a nM
Citation
 Cardinaletti, CMattioli, LGhelfi, FDel Bello, FGiannella, MBruzzone, AParis, HPerfumi, MPiergentili, AQuaglia, WPigini, M Might adrenergic alpha2C-agonists/alpha2A-antagonists become novel therapeutic tools for pain treatment with morphine? J Med Chem 52:7319-22 (2009)  
Target
Name:
Alpha-2C adrenergic receptor
Synonyms:
ADA2C_HUMAN ADRA2L2 Adrenergic alpha2C Adrenergic receptor alpha Alpha-2 adrenergic receptor subtype C4 Alpha-2C adrenoreceptor | adrenergic, alpha-2C-, receptor [Homo sapiens]
Type:
Enzyme
Mol. Mass.:
49552.32
Organism:
Homo sapiens (Human)
Description:
P18825
Residue:
462
  
Inhibitor
Name:
BDBM50415136
Synonyms:
CHEMBL570973
Type:
Small organic molecule
Emp. Form.:
C14H18N2O
Mol. Mass.:
230.3055
SMILES:
CC(OC1=NCCN1)c1ccccc1CC=C
: