Target
5-hydroxytryptamine receptor 1A
Ligand
BDBM50415777
Substrate
Meas. Tech.
ChEMBL_615926 (CHEMBL1099772)
Ki
0.129±n/a nM
Citation
 Franchini, SPrandi, ASorbi, CTait, ABaraldi, AAngeli, PBuccioni, MCilia, APoggesi, EFossa, PBrasili, L Discovery of a new series of 5-HT1A receptor agonists. Bioorg Med Chem Lett 20:2017-20 (2010)  
Target
Name:
5-hydroxytryptamine receptor 1A
Synonyms:
5-HT-1A 5-hydroxytryptamine receptor 1A (5-HT-1A) ADRB2RL1 Dopamine D2 receptor and serotonin 1a receptor HTR1A | Serotonin receptor 1A
Type:
Mol. Mass.:
46122.49
Organism:
Homo sapiens (Human)
Description:
Residue:
422
  
Inhibitor
Name:
BDBM50415777
Synonyms:
CHEMBL1086156
Type:
Small organic molecule
Emp. Form.:
C25H27NO2S2
Mol. Mass.:
437.617
SMILES:
COc1ccccc1OCCNCC1CSC(S1)(c1ccccc1)c1ccccc1
: