Target
Thymidylate synthase
Ligand
BDBM50006690
Substrate
Meas. Tech.
ChEMBL_628669 (CHEMBL1106435)
IC50
1148±n/a nM
Citation
 Srivastava, VGupta, SPSiddiqi, MIMishra, BN 3D-QSAR studies on quinazoline antifolate thymidylate synthase inhibitors by CoMFA and CoMSIA models. Eur J Med Chem 45:1560-71 (2010)  
Target
Name:
Thymidylate synthase
Synonyms:
TS TYMS Thymidylate synthase (TS) | Thymidylate synthase/GAR transformylase/AICAR transformylase
Type:
Enzyme
Mol. Mass.:
35718.07
Organism:
Homo sapiens (Human)
Description:
Residue:
313
  
Inhibitor
Name:
BDBM50006690
Synonyms:
(S)-2-(3-fluoro-4-(methyl((2-methyl-4-oxo-3,4-dihydroquinazolin-6-yl)methyl)amino)benzamido)pentanedioic acid 2-{3-Fluoro-4-[methyl-(2-methyl-4-oxo-3,4-dihydro-quinazolin-6-ylmethyl)-amino]-benzoylamino}-pentanedioic acid ;hydrate(H2O) | CHEMBL73971
Type:
Small organic molecule
Emp. Form.:
C23H23FN4O6
Mol. Mass.:
470.4503
SMILES:
CN(Cc1ccc2nc(C)[nH]c(=O)c2c1)c1ccc(cc1F)C(=O)N[C@@H](CCC(O)=O)C(O)=O
: