Target
Thymidylate synthase
Ligand
BDBM50006684
Substrate
Meas. Tech.
ChEMBL_628669 (CHEMBL1106435)
IC50
1445±n/a nM
Citation
 Srivastava, VGupta, SPSiddiqi, MIMishra, BN 3D-QSAR studies on quinazoline antifolate thymidylate synthase inhibitors by CoMFA and CoMSIA models. Eur J Med Chem 45:1560-71 (2010)  
Target
Name:
Thymidylate synthase
Synonyms:
TS TYMS Thymidylate synthase (TS) | Thymidylate synthase/GAR transformylase/AICAR transformylase
Type:
Enzyme
Mol. Mass.:
35718.07
Organism:
Homo sapiens (Human)
Description:
Residue:
313
  
Inhibitor
Name:
BDBM50006684
Synonyms:
(S)-2-(3-fluoro-4-(((2-methyl-4-oxo-3,4-dihydroquinazolin-6-yl)methyl)(prop-2-ynyl)amino)benzamido)pentanedioic acid 2-{3-Fluoro-4-[(2-methyl-4-oxo-3,4-dihydro-quinazolin-6-ylmethyl)-prop-2-ynyl-amino]-benzoylamino}-pentanedioic acid ;hydrate(H2O) | CHEMBL307399
Type:
Small organic molecule
Emp. Form.:
C25H23FN4O6
Mol. Mass.:
494.4717
SMILES:
Cc1nc2ccc(CN(CC#C)c3ccc(cc3F)C(=O)N[C@@H](CCC(O)=O)C(O)=O)cc2c(=O)[nH]1
: