Target
Thymidylate synthase
Ligand
BDBM50006691
Substrate
Meas. Tech.
ChEMBL_628669 (CHEMBL1106435)
IC50
302±n/a nM
Citation
 Srivastava, VGupta, SPSiddiqi, MIMishra, BN 3D-QSAR studies on quinazoline antifolate thymidylate synthase inhibitors by CoMFA and CoMSIA models. Eur J Med Chem 45:1560-71 (2010)  
Target
Name:
Thymidylate synthase
Synonyms:
TS TYMS Thymidylate synthase (TS) | Thymidylate synthase/GAR transformylase/AICAR transformylase
Type:
Enzyme
Mol. Mass.:
35718.07
Organism:
Homo sapiens (Human)
Description:
Residue:
313
  
Inhibitor
Name:
BDBM50006691
Synonyms:
(S)-2-(4-(methyl((2-methyl-4-oxo-3,4-dihydroquinazolin-6-yl)methyl)amino)benzamido)pentanedioic acid 2-{4-[Methyl-(2-methyl-4-oxo-3,4-dihydro-quinazolin-6-ylmethyl)-amino]-benzoylamino}-pentanedioic acid ;hydrate(0.75H2O) | CHEMBL40321
Type:
Small organic molecule
Emp. Form.:
C23H24N4O6
Mol. Mass.:
452.4599
SMILES:
CN(Cc1ccc2nc(C)[nH]c(=O)c2c1)c1ccc(cc1)C(=O)N[C@@H](CCC(O)=O)C(O)=O
: